编程知识 cdmana.com

React compilation failed NPM err! Failed at the test@1.0.0 start script.

code ELIFECYCLE
npm ERR! errno 1
npm ERR! test@1.0.0 start: node build/dev-server.js
npm ERR! Exit status 1
npm ERR!
npm ERR! Failed at the test@1.0.0 start script.
npm ERR! This is probably not a problem with npm. There is likely additional logging output above.
npm ERR! A complete log of this run can be found in:
npm ERR! C:\Users\Administrator\AppData\Roaming\npm-cache_logs\2018-08-01T05_56_12_498Z-debug.log







terms of settlement :
npm cache clean --force
npm install
npm install realm@2.1.0 --ignore-scripts


If this happens again :'D:\andex\stofrontend\node_modules\node-sass\vendor

npm rebuild node-sass

And then it solved

版权声明
本文为[osc_ s7fsyuo1]所创,转载请带上原文链接,感谢
https://cdmana.com/2020/12/20201225105145626S.html

Scroll to Top